Unity Xcode Clang Error

Technical Note TN2339: Building from the Command Line with Xcode FAQ

Technical Note TN2339: Building from the Command Line with Xcode FAQ

Swift (Programming Language) - portablecontacts net

Swift (Programming Language) - portablecontacts net

Clang++ exe error linker command failed with exit code 1 | clang

Clang++ exe error linker command failed with exit code 1 | clang

iphone unexpected library not found for-lPods : Code Examples

iphone unexpected library not found for-lPods : Code Examples

How to Install Pygame | Computer Science

How to Install Pygame | Computer Science

Setup Audience Network · Easy Mobile User Guide

Setup Audience Network · Easy Mobile User Guide

clang Error: Linker Command Failed for Unity in Native - Stack Overflow

clang Error: Linker Command Failed for Unity in Native - Stack Overflow

Firebase for Unity (iOS) linker errors (ARCHIVE FAILED) - Google

Firebase for Unity (iOS) linker errors (ARCHIVE FAILED) - Google

Precompiled Headers and Unity (Jumbo) Builds in upcoming CMake - Qt Blog

Precompiled Headers and Unity (Jumbo) Builds in upcoming CMake - Qt Blog

clang: error: linker command failed with exit code 1の様々な原因

clang: error: linker command failed with exit code 1の様々な原因

Integrating Unity and Vuforia with a iOS Swift Project | Agnostic

Integrating Unity and Vuforia with a iOS Swift Project | Agnostic

Basic setup of SDK - Aryzon SDK - Aryzon

Basic setup of SDK - Aryzon SDK - Aryzon

Dancing in the Debugger — A Waltz with LLDB · objc io

Dancing in the Debugger — A Waltz with LLDB · objc io

WWDC18: Modern Tips for Optimising Swift Build Time in Xcode 10 – XCBLOG

WWDC18: Modern Tips for Optimising Swift Build Time in Xcode 10 – XCBLOG

Unity Lessons - Xcode - How to Fix Mach-O Linker Errors when Building in  Xcode from Unity

Unity Lessons - Xcode - How to Fix Mach-O Linker Errors when Building in Xcode from Unity

ios - ld: library not found for -lVuforia - Oipapio- oipapio com

ios - ld: library not found for -lVuforia - Oipapio- oipapio com

Xcode 10 2, macOS Mojave 10 14 4, iOS 12 1 and other betas / Badoo

Xcode 10 2, macOS Mojave 10 14 4, iOS 12 1 and other betas / Badoo

Unity Manual | Adobe Flash | Unity (Game Engine)

Unity Manual | Adobe Flash | Unity (Game Engine)

MessagePack: It's like JSON  but fast and small

MessagePack: It's like JSON but fast and small

The Mobile App Launch Checklist — How to Ship Apps Like a Boss

The Mobile App Launch Checklist — How to Ship Apps Like a Boss

How to solve an error

How to solve an error "linker command failed with exit code 1 (use

All about Missing dSYMs — Fabric for Apple documentation

All about Missing dSYMs — Fabric for Apple documentation

Creating a Static Library in iOS Tutorial | raywenderlich com

Creating a Static Library in iOS Tutorial | raywenderlich com

Unity-Technologies / Unity-ARKit-Plugin / Pull request #6: Support

Unity-Technologies / Unity-ARKit-Plugin / Pull request #6: Support

Developers - iOS - Xcode: linker command failed with exit code 1

Developers - iOS - Xcode: linker command failed with exit code 1

Xcode 10 2, macOS Mojave 10 14 4, iOS 12 1 and other betas / Badoo

Xcode 10 2, macOS Mojave 10 14 4, iOS 12 1 and other betas / Badoo

Apple Mach-O Linker Error - When Building iOS Samples | Vuforia

Apple Mach-O Linker Error - When Building iOS Samples | Vuforia

Execute native ios code in unity - Game Development Stack Exchange

Execute native ios code in unity - Game Development Stack Exchange

How to Boost Performance With Intel Parallel STL and C++17 Parallel

How to Boost Performance With Intel Parallel STL and C++17 Parallel

Unity, Xcode and clang: error: linker command failed with exit code

Unity, Xcode and clang: error: linker command failed with exit code

Unity Manual | Adobe Flash | Unity (Game Engine)

Unity Manual | Adobe Flash | Unity (Game Engine)

Buy Crashy Racing App source code - Sell My App

Buy Crashy Racing App source code - Sell My App

Unity - Manual: Troubleshooting on iOS devices

Unity - Manual: Troubleshooting on iOS devices

已解决】Xcode编译出错:Module compiled with Swift 4 0 1 cannot be

已解决】Xcode编译出错:Module compiled with Swift 4 0 1 cannot be

Cocoapods remove duplicate symbols for architecture i386 error

Cocoapods remove duplicate symbols for architecture i386 error

Ld Framework Not Found Xcode | Framebob org

Ld Framework Not Found Xcode | Framebob org

建置Unity iOS xcode 專案遇到的錯誤與解決方案(Linker error)

建置Unity iOS xcode 專案遇到的錯誤與解決方案(Linker error)

Burst User Guide | Package Manager UI website

Burst User Guide | Package Manager UI website

Adwords Mobile Apps Conversion Tracking and Remarketing For Unity

Adwords Mobile Apps Conversion Tracking and Remarketing For Unity

Build Error with Unity4 6 2/xcode6 1->Linker Errors

Build Error with Unity4 6 2/xcode6 1->Linker Errors

Fix for

Fix for "undefined symbols" when building in Xcode 6 - x-code

Xcode 빌드시 link binary with libraries에 있는 framework를 못찾는 문제

Xcode 빌드시 link binary with libraries에 있는 framework를 못찾는 문제

Cocoapods remove duplicate symbols for architecture i386 error

Cocoapods remove duplicate symbols for architecture i386 error

opencv xcode 9 Undefined symbols for architecture arm64: - OpenCV

opencv xcode 9 Undefined symbols for architecture arm64: - OpenCV

Xcode link issue  CURRENT_ARCH not correct - Autodesk Community

Xcode link issue CURRENT_ARCH not correct - Autodesk Community

iOS Deployment Target issue - iOS SDK version not available  Highest

iOS Deployment Target issue - iOS SDK version not available Highest

iOS Build Environment for Windows by Pierre-Marie Baty

iOS Build Environment for Windows by Pierre-Marie Baty

Read-Compile-Run-Loop - a tiny REPL for C++ - Not just gamedev

Read-Compile-Run-Loop - a tiny REPL for C++ - Not just gamedev

Creating and Distributing an iOS Binary Framework | Instabug Blog

Creating and Distributing an iOS Binary Framework | Instabug Blog

Building Unreal Engine from Source | Unreal Engine Documentation

Building Unreal Engine from Source | Unreal Engine Documentation

unity接ios的sdk的一些坑/ zhongruitech com

unity接ios的sdk的一些坑/ zhongruitech com

iOS - Xcode: linker command failed with exit code 1, using firebase

iOS - Xcode: linker command failed with exit code 1, using firebase

Xcode 10 2, macOS Mojave 10 14 4, iOS 12 1 and other betas / Badoo

Xcode 10 2, macOS Mojave 10 14 4, iOS 12 1 and other betas / Badoo

How To Upgrade to Vuforia 7 2 + Unity 2018 1 6f + Xcode 9 4 · Issue

How To Upgrade to Vuforia 7 2 + Unity 2018 1 6f + Xcode 9 4 · Issue

Basic setup of SDK - Aryzon SDK - Aryzon

Basic setup of SDK - Aryzon SDK - Aryzon

Clang failed with exit code 1 | go  2019-02-23

Clang failed with exit code 1 | go 2019-02-23

How to Integrate the AppLovin SDK into your Game Step By Step

How to Integrate the AppLovin SDK into your Game Step By Step

Unity Plugins for Android and iOS - Plato Evolved

Unity Plugins for Android and iOS - Plato Evolved

Installing Nvidia CUDA on Mac OSX for GPU-Based Parallel Computing

Installing Nvidia CUDA on Mac OSX for GPU-Based Parallel Computing

Hi, my name is Arvid Gerstmann  And this is FASTBuild: A Short

Hi, my name is Arvid Gerstmann And this is FASTBuild: A Short

ROCm Libraries — ROCm Documentation 1 0 0 documentation

ROCm Libraries — ROCm Documentation 1 0 0 documentation

Unity 4 6 2 iOS 64-bit support – Unity Blog

Unity 4 6 2 iOS 64-bit support – Unity Blog

Evade the macOS 'Too Many Open Files' Error by Pushing the Limits

Evade the macOS 'Too Many Open Files' Error by Pushing the Limits

libEasyARUnity a-arm64-master o

libEasyARUnity a-arm64-master o" does not contain bitcode - EasyAR FAQ

0 9 7 6 - external/github com/g-truc/glm - Git at Google

0 9 7 6 - external/github com/g-truc/glm - Git at Google

TensorFlow for Mobile Poets « Pete Warden's blog

TensorFlow for Mobile Poets « Pete Warden's blog

Birthday Cake Party Unity 3D Game Source Code - Kids Games - Unity

Birthday Cake Party Unity 3D Game Source Code - Kids Games - Unity

Open Source Code Obfuscation Tool for Protecting iOS Apps | Polidea

Open Source Code Obfuscation Tool for Protecting iOS Apps | Polidea

Precompiled Headers and Unity (Jumbo) Builds in upcoming CMake - Qt Blog

Precompiled Headers and Unity (Jumbo) Builds in upcoming CMake - Qt Blog

Ios Xcode 8 Apple Mach-O Linker (ld) Error Group in xcode - ionic-v3

Ios Xcode 8 Apple Mach-O Linker (ld) Error Group in xcode - ionic-v3

clang: error: linker command failed with exit code 1 (XMPP library

clang: error: linker command failed with exit code 1 (XMPP library